Ho scaricato la nuova versione, ma in compilazione va in errore
make[5]: *** [ggridview.lo] Error 1
make[5]: Leaving directory `/usr/src/gambas2-2.13.0/gb.gtk/src'
make[4]: *** [all-recursive] Error 1
make[4]: Leaving directory `/usr/src/gambas2-2.13.0/gb.gtk/src'
make[3]: *** [all-recursive] Error 1
make[3]: Leaving directory `/usr/src/gambas2-2.13.0/gb.gtk'
make[2]: *** [all] Error 2
make[2]: Leaving directory `/usr/src/gambas2-2.13.0/gb.gtk'
make[1]: *** [all-recursive] Error 1
make[1]: Leaving directory `/usr/src/gambas2-2.13.0'
make: *** [all] Error 2
ho dato uno sguardo alla ml ufficiale, altri utenti hanno lo stesso identico problema.
E' successa la stessa cosa anche a voi?
L'ho provato ora su Hardy al lavoro ed ho lo stesso errore:
ggridview.cpp: In function ‘gboolean cb_scroll(GtkWidget*, GdkEventScroll*, gGridView*)’:
ggridview.cpp:677: error: ‘gtk_adjustment_get_step_increment’ was not declared in this scope
make[5]: *** [ggridview.lo] Error 1
make[5]: *** Waiting for unfinished jobs....
g++ -DHAVE_CONFIG_H -I. -I.. -I/usr/include/gtk-2.0 -I/usr/lib/gtk-2.0/include -I/usr/include/atk-1.0 -I/usr/include/cairo -I/usr/include/pango-1.0 -I/usr/include/glib-2.0 -I/usr/lib/glib-2.0/include -I/usr/include/freetype2 -I/usr/include/libpng12 -I/usr/include/pixman-1 -I../share -pipe -Wall -fno-exceptions -Wno-unused-value -fsigned-char -fvisibility=hidden -g -Os -fno-omit-frame-pointer -MT giconview.lo -MD -MP -MF .deps/giconview.Tpo -c giconview.cpp -fPIC -DPIC -o .libs/giconview.o
mv -f .deps/gtreeview.Tpo .deps/gtreeview.Plo
mv -f .deps/giconview.Tpo .deps/giconview.Plo
make[5]: Leaving directory `/home/geuropa/Documenti/Software/Programmazione/Gambas/gambas2-2.13.0/gb.gtk/src'
make[4]: *** [all-recursive] Error 1
make[4]: Leaving directory `/home/geuropa/Documenti/Software/Programmazione/Gambas/gambas2-2.13.0/gb.gtk/src'
make[3]: *** [all-recursive] Error 1
make[3]: Leaving directory `/home/geuropa/Documenti/Software/Programmazione/Gambas/gambas2-2.13.0/gb.gtk'
make[2]: *** [all] Error 2
make[2]: Leaving directory `/home/geuropa/Documenti/Software/Programmazione/Gambas/gambas2-2.13.0/gb.gtk'
make[1]: *** [all-recursive] Error 1
make[1]: Leaving directory `/home/geuropa/Documenti/Software/Programmazione/Gambas/gambas2-2.13.0'
make: *** [all] Error 2
E meno male che questa release doveva sistemare i bug del componente gb.gtk...